Beschaffungsbeauftragung
type: Function
type: Class
is associated with: SAPMM
updates: Projektauftrag
uses: SachkontoITInvestitionen
subclass of: Bestellungsbearbeitung
definition: Die Beschaffung wird beauftragt und auf das entsprechende Budget geschaut. Anschließend geht ein Auftrag aus SAP raus und eine Rückmeldung geht an den Auftraggeber zurück.