Change Advisory Board
type: Class
type: Role
subclass of: InformationManagementStaff
definition: Das CAB unterstützt den Change-Manager, Changes hinsichtlich des Business Impacts einzuschätzen und zu priorisieren. Wenn ein CAB einberufen wird, müssen die ausgewählten Mitglieder fähig sein, den Change sowohl vom Standpunkt des Geschäfts, als auch vom technischen Standpunkt aus beurteilen zu können. Um diesen Mix zu erreichen, müssen im CAB sowohl Personen mit einem klaren Verständnis für die Geschäftsanforderungen des Kunden vertreten sein als auch Anwender und Vertreter aus den technischen Entwicklungs- und Supportbereichen. @de
alternative label: CAB
is involved in: CABDurchfuehrung
is involved in: ChangeRequestUeberwachung
is responsible for function: ChangeRequestEntscheidung
is responsible for function: ChangeRequestErfassung
is responsible for function: ChangeRequestPruefung
role component: Abteilungsleiter
role component: Bereichsassistenz
role component: ChiefInformationOfficer