Change Antrag
type: EntityType
type: Class
entity type component: ChangeAntragProtokoll
master: Kollaborationsplattform
subclass of: EntityType
alternative label: Change Request
alternative label: Request for Change
alternative label: RfC
definition: Ein Change Antrag kommt per Email und (papierbasiert) per Hauspost. Für den B1 ist nur der unterschriebene RfC relevant. @de