Projektplanung
type: Function
type: Class
is associated with: MSExcel
is associated with: MSProject
is associated with: MSSharePoint
is associated with: SAPCats
updates: Projektdefinition
updates: Projektplan
updates: Projektwebsite
uses: Projektbudget
uses: Projektportfolio
label: Project Planning @en
subclass of: Projektmanagement
definition: Zeitplanung, Priorisieren, Aufgaben zuweisen, Berechtigungen einstellen u.a.