Administratives Informationsmanagement
type: Function
type: Class
page: 25
chapter: ERMOD
consolidated: true
function component: InformationssystemeEinfuehren
function component: VertraegeVerhandelnUndVerwalten
function component: WissensgenerierungUndVerteilung
updates: Datensystem
updates: Geschaeftsprozess
updates: Informationssystem
updates: KomponenteInformationsinfrastruktur
updates: Personal
uses: Datensystem
uses: Geschaeftsprozess
uses: KomponenteInformationsinfrastruktur
uses: Personal
uses: StrategischerItPlan
label: Administrative Information Management Task @en
subclass of: ImAufgabe
broad match: InformationManagement
definition: [...] Projekte auf der administrativen Managementebene in Komponenten umgesetzt wird (insbesondere in Informationssysteme). Die Entwicklung und Einführung von Informationssystemen umfasst Aufgaben (z. B. Softwareentwicklung) die wesentlicher Bestandteil eines IM-Modells sind in ein IM-Konzept eingehen und institutionalisiert werden. Darüber hinaus sind Aufgaben des administrativen Informationsmanagements Bestandteil des IM-Modells welche die Informationsfunktion und Informationsinfrastruktur insgesamt oder einzelne ihrer Komponenten zum Gegenstand haben sich also nicht auf eine projektbezogene Betrachtung beschränken. Objekte derartiger ganzheitlicher administrativer Aufgaben sind Personal Datensystem Geschäftsprozesse Wissensgenerierung und -verteilung sowie Verhandeln und Verwalten von Verträgen.