Analyse und Evaluation des Entwicklungsrückstaus
type: Function
type: Class
page: 127
chapter: SPLAN
consolidated: false
subclass of: Function
definition: Das Analysieren und Evaluieren des Entwicklungsrückstaus setzt voraus dass alle nicht beteiligten Entwicklungsbedarfe laufend erfasst mit geeigneten Kriterien beschrieben und dokumentiert werden (z.B. Geschätzter Realisierungsaufwand erwarteter Beitrag zum Unternehmenserfolg Verweildauer im Entwicklungsrückstau Gründe für die Nichtfreigabe ).