Anwenden eines Planungsinstrumentariums
type: Class
type: Function
subclass of: Function
chapter: SPLAN
definition: Fünfter Grundsatz: Anwenden eines Planungsinstrumentariums. Da ein geschlossenes Planungsinstrumentariums nicht zu Verfügung steht sollen IT-Management und Linienmanagement Regeln vereinbaren um den Ablauf des Planungsprozesses zu organisieren und die dafür einzusetzenden Methoden und Werkzeuge festzulegen.
consolidated: false
page: 135