Anwenden eines Planungsinstrumentariums
type: Function
type: Class
page: 135
chapter: SPLAN
consolidated: false
subclass of: Function
definition: Fünfter Grundsatz: Anwenden eines Planungsinstrumentariums. Da ein geschlossenes Planungsinstrumentariums nicht zu Verfügung steht sollen IT-Management und Linienmanagement Regeln vereinbaren um den Ablauf des Planungsprozesses zu organisieren und die dafür einzusetzenden Methoden und Werkzeuge festzulegen.