Aufgabenanalyse
type: Function
type: Class
page: 137
page: 140
page: 237
page: 240
page: 427
page: 81
chapter: INBAN
chapter: INVER
chapter: PERSM
chapter: STRUK
consolidated: false
updates: Informationsbedarf
updates: Teilaufgabe
uses: Aufgabe
label: Task Analysis @en
label: task analysis @en
subclass of: Informationsbedarfsanalysemethode
definition: Zerlegen von Aufgaben in Teilaufgaben und dieser in Tätigkeiten zwecks Bestimmung des Möglichkeitsraums der Arbeitsteilung.
definition: Zerlegung von Aufgaben in Teilaufgaben und dieser in Tätigkeiten zwecks Bestimmung des Möglichkeitsraums der Arbeitsteilung.