Ausweichrechenzentrum
type: EntityType
type: Class
consolidated: false
label: Notfallrechenzentrum
label: Backup Computing Center @en
subclass of: EntityType
definition: Rechenzentrum in das im Notfall Anwendungen verlagert werden so dass zumindest ein Notbetrieb möglich ist.