Begriff
type: Class
type: EntityType
label: Concept @en
subclass of: EntityType
definition: Wissenseinheit der Merkmale für ein Objekt die durch einen Namen (Bezeichner) oder die Vorstellung einer Person darüber kommunizierbar wird; die Merkmale umfassen das Wissen das über das Objekt existiert. Begriffe werden definiert.
consolidated: false