Berücksichtigen der bestehenden IT-Architektur
type: Function
type: Class
page: 135
chapter: SPLAN
consolidated: false
subclass of: Function
definition: Berücksichtigen der bestehenden IT-Architektur bzw. ihrer durch strategische Zielplanung und Strategieentwicklung gewollten Veränderung um Maßnahmen zu vermeiden die zu Inkonsistenzen oder Redundanzen führen.
definition: Sechster Grundsatz: Berücksichtigen der bestehenden IT-Architektur bzw. ihrer durch strategische Zielplanung und Strategieentwicklung gewollten Veränderung um Maßnahmen zu velmeiden die zu Inkonsistenzen oder Redundanzen führen.