Beschreibung von Lieferungen und Leistungen
type: Class
type: EntityType
subclass of: Vertragszweck
chapter: VERMAN
definition: Genaue beschreibung von Lieferungen und Leistungen sowie von Lieferungs- und Leistungsbedingungen damit Mitarbeiter die später mit der Vertragsdurchführung befasst sind klare Regelungen vorfinden.
consolidated: false
page: 299