Beschreibung von Lieferungen und Leistungen
type: EntityType
type: Class
page: 299
chapter: VERMAN
consolidated: false
subclass of: Vertragszweck
definition: Genaue beschreibung von Lieferungen und Leistungen sowie von Lieferungs- und Leistungsbedingungen damit Mitarbeiter die später mit der Vertragsdurchführung befasst sind klare Regelungen vorfinden.