Bestimmen der Messobjekte für jedes Messziel
type: Class
type: Function
subclass of: Function
chapter: CONTR
definition: Bestimmen der Messobjekte für jedes Messziel. Messobjekte werden aus dem Zielinhalt des Messziels abgeleitet; ein Messziel kann durch ein oder mehrere Messobjekte erfasst werden. Beispiel: Arbeitstagebücher der Projekhnitarbeiter.
consolidated: false
page: 203