CMMI
type: EntityType
type: Class
page: 489
chapter: INBAN
consolidated: false
entity type component: 1Initial
entity type component: 2Managed
entity type component: 3Defined
entity type component: 4QuantitativelyManaged
entity type component: 5Optimizing
is associated with: CMM
label: Capability Maturity Model Integration @en
subclass of: Referenzmodell
subclass of: Reifegradmodell
alternative label: CMMI for Development @en
definition: Capability Maturity Model Integration; vom SEI herausgegebenes Reifegradmodell zur Evaluierung und Verbesserung von Entwicklungsprozessen.