COBIT
type: EntityType
type: Class
consolidated: false
subclass of: EntityType
definition: Leitlinien zur Gestaltung von IT-Governance bis zur Version 4.1 als Control Objectives for Information and Related Technology bezeichnet Version 5 trägt den Titel A Business Framework for the Governance and Management of Enterprise IT.