Check-Phase
type: EntityType
type: Class
page: 157
chapter: QUALM
consolidated: false
subclass of: EntityType
definition: In der Phase Check wird gerprüft ob der geänderte Prozess relevante Ziele erreicht. In diesem Zusammenhang werden auch die mit Hilfe des Prozesses erzeugten Produkte evaluiert. Check umfasst darüber hinaus die Identifikation von Ursachen möglicher Abweichungen.