Datenarchitektur
type: EntityType
type: Class
page: 250
page: 43
page: 47
chapter: ARCHI
chapter: DATEM
consolidated: false
consolidated: true
label: Data Architecture @en
subclass of: Teilarchitektur
definition: Modell der für das Unternehmen wesentlichen Datenbestände insbesondere der Datenbanken und Data-Warehouse-Systeme und ihrer strukturellen Beziehungen.
definition: Modell der für das Unternehmen wesentlichen Datenbestände insbesondere der Datenbanken und Data-Warehouse-Systeme und ihrer strukturellen Beziehungen. Zu einer Datenarchitektur gehören die für das betrachtete Aufgabengebiet wesentlichen Datenbestände und ihre strukturellen Beziehungen. Hierzu zählen insbesondere die für das Unternehmen wesentlichen Datenbanken und Data-Warehouse-Systeme (vgl. Lerneinheit DATEM).