Datenmanagement als Linienabteilung
type: Role
type: Class
page: 144
chapter: STRUK
consolidated: false
is responsible for function: Datenmanagement
subclass of: Abteilung
definition: Datenmanagement als Linienabteilung die direkt an die Unternehmensleitung berichtet (also als Struktureinheit neben der IT-Abteilung besteht)