Defensive Strategie
type: EntityType
type: Class
page: 115
chapter: STRAT
consolidated: true
is associated with: Strategiecharakter
subclass of: ItStrategie
definition: Die defensive Strategie versucht den technologieeinfluss im Unternehmen zurückzudrängen; sie kann im Grenzfall destruktiv sein (destruktive Strategie).