Durchführen der Projektplanung
type: Class
type: Function
label: Machbarkeitsstudie
subclass of: Function
chapter: SPLAN
definition: Zweck ist es die mit der Realisierung der Projektideen verbundenen Konsequenzen bezüglich Zeit (zeitpunkte und Zeiträume) Budget Personal Methoden Werkzeuge und sonstige Ressourcen zu ermitteln; damit werden die Voraussetzungen für eine realistische Evaluierung geschaffen.
consolidated: false
page: 129