Empfindlichkeitsanalyse
type: Class
type: Function
subclass of: Function
chapter: TECHM
definition: Mit der Empfindlichkeitsanalyse (auch als Sensitivitätsanalyse bezeiclmet) wird untersucht welche Auswirkung die Änderung der Parameter Zielertrag Skalenniveau Kriteriengewicht und Entscheidungsregel auf den ermittelten Nutzweli haben.
alternative label: Sensitivitätsanalyse
consolidated: false
page: 169