Entwurfsmuster
type: EntityType
type: Class
page: 17
chapter: ERMOD
consolidated: false
consolidated: true
label: Design Pattern @en
subclass of: EntityType
definition: wieder verwendbare Vorlage zur Lösung eines Entwurfsproblems die in einem spezifischen Kontext genutzt werden kann.