Ergänzung
type: EntityType
type: Class
page: 143
chapter: STRUK
consolidated: false
subclass of: Strukturkonzept
definition: Vorhandene Struktureinheiten insbesondere Organisationsabteilung und IT-Abteilung werden um einzelne Stabs- und Ausführungsstellen ergänzt die sich neuen IM-Aufgaben widmen.