European Network and Information Security Agency
type: Class
type: Role
label: ENISA @en
subclass of: Role
chapter: INBAN
definition: Einrichtung der europäischen Union die als Anlauf- und Beratungsstelle in Fragen der Netz- und Informationssicherheit für die Mitgliedsstaaten und die EU-Organe gilt.
consolidated: false
page: 471