Festlegen der Messgrößentransformation
type: Class
type: Function
subclass of: Function
chapter: CONTR
definition: Festlegen der Messgrößentransformation. Der Controlling Zyklus vom gemessenen Istwe11 zum geplanten Sollwe11 wird damit geschlossen. Beispiel: Messgrößentransformation nicht erforderlich wenn Sollwert und Istwert von gleicher Dimension sind (z. B. Zeiteinheiten Geldeinheiten Stück).
consolidated: false
page: 204