Gatekeeping
type: EntityType
type: Class
page: 79
page: 85
chapter: INVER
consolidated: false
subclass of: InterpersonellesInformationsverhalten
definition: Nach Barzilai-nahon gibt es zahlreiche Gatekeeping-Aktivitäten einige davon sind Manipulation Vorenthaltung Umformung Missachtung und Veröffentlichung von Informationen.
definition: Prozess zum Kontrollieren eines Informationsflusses um sich einen persönlichen Vorteil in der Regel auf Kosten anderer zu verschaffen.
definition: Prozess zum Kontrollieren eines Informationsflusses um sich einen persönlichen Vorteil in der Regel zum auf Kosten anderer zu verschaffen.