Geschäftsmodell
type: EntityType
type: Class
page: 17
chapter: ERMOD
consolidated: false
consolidated: true
is based on: Produktionsfaktor
is based on: Unternehmensstrategie
label: Business Model @en
subclass of: Modell
definition: Modell das Aussagen darüber macht durch welche Kombination von Produktionsfaktoren die Unternehmensstrategie verfolgt wird wie Erlöse erzielt werden und welche Rolle die daran beteiligten Akteure spielen.