Geschäftsprozess-Referenzmodell
type: EntityType
type: Class
page: 439
chapter: INBAN
consolidated: false
subclass of: Referenzmodell
definition: Referenzmodelle für Geschäftsprozesse bilden gewollten oder geplante Zustände von Prozessen ab an denen ihr gegenwärtiger Zustand beurteilt werden kann. Sie dienen auch als Vorbilder zur Ableitung Planung und zum Entwurf neuer Prozesse.