Ablauforganisation gestalten
type: Function
type: Class
page: 29
chapter: ERMOD
consolidated: true
subclass of: Function
definition: zeitlich-sachlogisches Strukturieren der zur Aufgabenerfüllung erforderlichen Arbeitsprozesse