Gestaltungsmodell
type: EntityType
type: Class
page: 18
chapter: ERMOD
consolidated: true
label: Design Model @en
subclass of: Modell
definition: Im vorliegenden Zusammenhang bedeutet Modell die Konstmktion eines Vorbilds für die Wirklichkeit nämlich eines Vorbilds für die Entwicklung eines IM-Konzepts. In der Fachsprache wird neben vielen anderen Unterscheidungen zwischen Erklärungsmodell und Gestaltungsmodell unterschieden. Das Modell des Informationsmanagements (IMModell) ist ein Erklämngsmodell das IM-Konzept ist Gestaltungsmodell.