ISACA
type: Class
type: EntityType
type: Role
label: Information Systems Audit and Control Association @en
subclass of: EntityType
subclass of: Role
chapter: GOVER
definition: Information Systems Audit and Control Association; internationaler Berufsverband für IT-Prüfungswesen -Revision und -Sicherheit
definition: Information Systems Audit and Control Association; internationaler Berufsverband für IT-Prüfungswesen -Revision und -Sicherheit der gemeinsam mit ITGI COBIT herausgibt.
consolidated: true
consolidated: false
page: 55