IM-Modell
type: EntityType
type: Class
page: 18
page: 23
chapter: ERMOD
consolidated: true
entity type component: ImAufgabe
entity type component: Managementebene
entity type component: Methode
is based on: Formalziel
is based on: Sachziel
label: information management model @en
subclass of: Erklaerungsmodell
subclass of: Referenzmodell
alternative label: Modell des Informationsmanagements
definition: Das Modell des Informationsmanagements (IM-Modell) ist ein Erklärungsmodell […]. --- Im vorliegenden Zusammenhang bedeutet Modell die Konstruktion eines Vorbilds für die Wirklichkeit nämlich eines Vorbilds für die Entwicklung eines IM-Konzepts. Das in drei Dimensionen gegliederte IM-Modell zeigt Abbildung ERMOD-1.