Information-Hiding-Prinzip
type: EntityType
type: Class
page: 52
chapter: ARCHI
consolidated: true
label: information hiding @en
subclass of: Architekturprinzip
subclass of: Gestaltungsprinzip
definition: Das Information-Hiding-Prinzip (Prinzip des Verbergens von Informationen) legt nahe dass einem Aufgabenträger nur der Teil der Information offenbart wird der für die jeweilige Aufgabe benötigt wird.