Informationsaufnahme
type: EntityType
type: Function
type: Class
page: 79
chapter: INVER
consolidated: false
label: Information Reception @en
label: information reception @en
subclass of: EntityType
subclass of: Function
definition: Registrierung von Reizen über Zustände und Vorgänge durch Sinnesorgane mit der Folge der Erweiterung des Wissenbestandes.
definition: Registrierung von Reizen über Zustände und Vorgänge durch Sinnesorgane mit der Folge der Erweiterung des Wissensbestands.