Informationsmanagement
type: Class
type: Function
label: Information Management @en
subclass of: ImAufgabe
chapter: RECHT
chapter: ERMOD
definition: Informationsmanagement ist primär Leitungshandeln das unter Beachtung relevanter rechtlicher zumeist gar nicht IT-spezifischer Regelungen (Gesetze und Rechtsprechung) erfolgt wie gewerblicher Rechtsschutz Urheber- und Wettbewerbsrecht sowie auch Strafrecht.
definition: Intrapersonelles und interpersonelles Informationsverhalten sind für die Durchführung von strategischen administrativen und operativen Aufgaben des Informationsmanagements sowie für die Methoden zur Aufgabenerfüllung von Bedeutung.
definition: Strukturmanagement als Aufgabe des Informationsmanagements geht davon aus dass eine Strukturorganisation des Unternehmens besteht in die das Ergebnis der Gliedemng des IT-Bereichs so eingefügt wird dass die Erreichung der strategischen Uternehmensziele bestmöglich unterstützt wird.
uses: Architektur
uses: InformationEngineering
uses: Informationsverhalten
uses: MethodikInformationsmanagement
uses: ZielInformationsmanagement
function component: OperativesInformationsmanagement
function component: StrategischesInformationsmanagement
function component: AdministrativesInformationsmanagement
function component: ItGovernanceAufgabe
function component: Servicemanagement
function component: Strukturmanagement
increases: Erfolgspotenzial
increases: Leistungspotenzial
homonym: InformationManagement
consolidated: true
consolidated: false
page: 68