Inhaltliche Mediumseigenschaft
type: EntityType
type: Class
page: 85
chapter: INVER
consolidated: false
subclass of: EntityType
definition: Befehl Versprechen Ankündigung Nachricht Unterhaltung Kommentar