Istzustand Analysieren
type: Function
type: Class
page: 96
chapter: SITAN
consolidated: true
subclass of: Function
definition: Es werden die Wettbewerbsfaktoren die kritisch sind (z. B. eine vergleichsweise lange Auftragsabwicklungszeit) und die Möglichkeiten zur Beeinflussung ihrer aktuellen WeIte durch IT-Investitionen (z. B. in verbesserte Systeme der Produktionsplanung und -steuerung) identifiziert.