IT-Abteilung
type: Role
type: Class
page: 137
chapter: STRUK
consolidated: false
is involved in: DurchfuehrungEinerErfolgsfaktorenanalyse
is involved in: Vertragsmanagement
role component: ItAbteilungEntwicklung
role component: ItAbteilungHelpdesk
role component: ItAbteilungLeitung
role component: ItAbteilungProduktion
label: IT departement @en
subclass of: Abteilung
alternative label: Mitarbeiter der IT-Abteilung
definition: Struktureinheit der administrative und operative Aufgaben des Informationsmanagements zugeordnet sind und die als Kostenstelle Profit Center oder Investment Center geführt wird.