Kommunikation
type: EntityType
type: Function
type: Class
page: 17
page: 338
page: 85
chapter: ERFAN
chapter: ERMOD
chapter: INVER
consolidated: false
consolidated: true
function component: SendenderBotschaft
uses: Informationsinfrastruktur
uses: Medium
label: communication @en
subclass of: SchluesselbereichfuerItErfolg
definition: Kommunikation ist ein sozialer Prozess der sowohl Informationsfähigkeit und -absicht des Senders als auch Interpretationsfähigkeit und -absicht des Empfängers voraussetzt.