Kommunikationsanalyse
type: Function
type: Class
page: 428
chapter: INBAN
consolidated: false
updates: Funktionsdiagramm
updates: Kommunikationsdiagramm
uses: Aufgabentraeger
subclass of: Informationsbedarfsanalysemethode
definition: Laut Koreimann (2000) können mit der Kommunikationsanalyse Kommunikationsbeziehungen in einem Unternehmen erfasst und gemessen werden. Gegenstand der Kommunikationsanalyse sind Aufgabenträger bzw. Kommunikationspartner Kommunikationsformen und -kanäle die Art der ausgetauschten Informationen sowie Kommunikationsanlässe und -zeiten.