Kreativitätstechnik
type: EntityType
type: Class
page: 125
page: 129
page: 451
chapter: INBAN
chapter: SPLAN
consolidated: false
label: Creativity Technique @en
label: creativity technique @en
subclass of: MethodeZurWissensentwicklung
definition: Heuristik zur Problemdefinition und zum Problemlösen sowie zum Entwerfen von Alternativen in Situationen die durch schlecht strukturierte Probleme und eine offene Entscheidungssituation gekennzeichnet sind.
definition: Mind mapping Morphologischer Kasten