Leistung
type: Class
type: EntityType
label: Performance @en
label: performance @en
subclass of: EntityType
chapter: INBAN
chapter: SZIEL
definition: 1. Fähigkeit eines Systems eine bestimmte Aufgabe in vorgegebener Zeit erfüllen zu können (Aufgabenerfüllung pro Zeiteinheit) (Lerneinheit SZIEL).; 2. Größe die für die ökonomische Beurteilung des Outputs eines Systems von Bedeutung ist und als Bezugsgröße für Kosten dient (Lerneinheit KOLER).; 3. im Sinne der Erfolgsfaktorenanalyse der von den Befragten geschätzte Beitrag eines Erfolgsfaktors zum Unternehmenserfolg (Lerneinheit ERFAN).
definition: Fähigkeit eines Systems eine bestimmte Aufgabe in vorgegebener Zeit erfüllen zu können (Aufgabenerfüllung pro Zeiteinheit).
definition: Größe die für die ökonomische Beurteilung des Outputs eines Systems von Bedeutung ist und als Bezugsgröße für Kosten dient.
consolidated: true
consolidated: false
page: 103
page: 459