Methodik
type: EntityType
type: Class
page: 20
chapter: ERMOD
consolidated: true
label: methodology @en
subclass of: EntityType
definition: Methodik meint erstens die Anweisung zur folgerichtigen und zweckmäßigen Lösung eines in der Regel komplexen und/oder komplizierten praktischen oder wissenschaftlichen Problems und zweitens die Lehre von den Methoden und ihrer planmäßigen praktischen oder wissenschaftlichen Anwendung.