Nachhaltigkeitsdenken
type: EntityType
type: Class
page: 21
chapter: ERMOD
consolidated: true
label: sustainable thinking @en
subclass of: EntityType
definition: Nachhaltigkeitsdenken heißt dass das Managementhandeln darauf ausgerichtet ist bei der Beschaffung Nutzung und Verwertung von IT-Betriebsmitteln Ressourcen zu schonen und Umweltschäden zu vermeiden. Dieses Denken charakterisierende Bezeichnungen sind Öko-IT oder Green IT.