OECD
type: Class
type: EntityType
type: Role
label: Organisation for Economic Co-operation and Development @en
subclass of: EntityType
subclass of: Role
chapter: GOVER
definition: Organisation for Economic Co-operation and Development; Organisation für wirtschaftliche Zusammenarbeit und Entwicklung.
consolidated: true
consolidated: false
page: 55