Outsourcing-Geber
type: Role
type: Class
consolidated: false
label: Outsourcing Provider @en
subclass of: Role
definition: Unternehmen dem IT-Aufgaben übertragen werden. Synonyme: Outsourcing-Anbieter Outsourcing-Dienstleister.