Portierbarkeit
type: EntityType
type: Class
page: 152
chapter: QUALM
consolidated: false
label: Übertragbarkeit @en
subclass of: Softwarequalitaet
definition: Eigenschaft eines Softwareproduktes in andere Hardware-/Softwareumgebungen übertragen werden zu können.