Prinzip der Selbstregulation der Struktureinheit
type: EntityType
type: Class
page: 141
chapter: STRUK
consolidated: false
subclass of: EntityType
definition: Schwankungen und Störungen der Aufgabenerfüllung sollen in der Struktureinheit in der sie entstehen aufgefangen und nicht unkontrolliert an andere Struktureinheiten weiter gegeben werden.